Target
Tryptophan 5-hydroxylase 2
Ligand
BDBM445684
Substrate
Meas. Tech.
In Vitro Enzyme Activity Assay
IC50
24.0±10 nM
Citation
 Bader, MSpecker, EMatthes, SSchütz, AMallow, KGrohmann, MNazaré, M Xanthine derivatives, their use as a medicament, and pharmaceutical preparations comprising the same US Patent  US11028104 Publication Date 6/8/2021 
Target
Name:
Tryptophan 5-hydroxylase 2
Synonyms:
NTPH TPH2_HUMAN
Type:
PROTEIN
Mol. Mass.:
56055.12
Organism:
Homo sapiens (Human)
Description:
ChEMBL_487490
Residue:
490
  
Inhibitor
Name:
BDBM445684
Synonyms:
Ex. 20/KM-06-107/(I-20) US11028104, Example 20
Type:
Small organic molecule
Emp. Form.:
C24H21ClN8O2S
Mol. Mass.:
520.994
SMILES:
CCn1c2nc(Cc3cn4cc(Cl)sc4n3)n(Cc3ccc(cc3)-c3ccn(C)n3)c2c(=O)[nH]c1=O
: