BDBM100007 2,8,10-trimethyl-N-(2-morpholin-4-ylethyl)pyrido[2,3]pyrazolo[2,4-a]pyrimidin-4-amine::2,8,10-trimethyl-N-[2-(4-morpholinyl)ethyl]-4-pyrido[2,3]pyrazolo[2,4-a]pyrimidinamine::2-morpholinoethyl-(2,8,10-trimethylpyrido[2,3]pyrazolo[2,4-a]pyrimidin-4-yl)amine::MLS000083949::SMR000048616::cid_667283
SMILES Cc1cc(C)c2c(nn3c(NCCN4CCOCC4)cc(C)nc23)n1
InChI Key InChIKey=UTBXKOCFJVVPEY-UHFFFAOYSA-N
Data  1 EC50
  Tab Delimited (TSV)   2D SDfile   Computed 3D by Vconf -m prep SDfile
Find this compound or compounds like it in BindingDB:
Activity Spreadsheet -- Enzyme Inhibition Constant Data from BindingDB
Found 1 hit for monomerid = 100007
TargetKallikrein-7(Homo sapiens (Human))
The Scripps Research Institute Molecular Screening Center
Curated by PubChem BioAssay
LigandPNGBDBM100007(2,8,10-trimethyl-N-(2-morpholin-4-ylethyl)pyrido[2...)
Affinity DataEC50:  3.48E+4nM
In DepthDetails PCBioAssay