BDBM100024 MLS000113735::N-(2-thiophen-2-yl-3H-benzimidazol-5-yl)acetamide::N-(2-thiophen-2-yl-3H-benzimidazol-5-yl)ethanamide::N-[2-(2-thienyl)-3H-benzimidazol-5-yl]acetamide::SMR000109627::cid_892943
SMILES CC(=O)Nc1ccc2nc([nH]c2c1)-c1cccs1
InChI Key InChIKey=NGHHXSPOPRWEDX-UHFFFAOYSA-N
Data  1 EC50
  Tab Delimited (TSV)   2D SDfile   Computed 3D by Vconf -m prep SDfile
Find this compound or compounds like it in BindingDB:
Activity Spreadsheet -- Enzyme Inhibition Constant Data from BindingDB
Found 1 hit for monomerid = 100024
TargetKallikrein-7(Homo sapiens (Human))
The Scripps Research Institute Molecular Screening Center
Curated by PubChem BioAssay
LigandPNGBDBM100024(MLS000113735 | N-(2-thiophen-2-yl-3H-benzimidazol-...)
Affinity DataEC50:  8.78E+3nM
In DepthDetails PCBioAssay