BDBM100029 4-(4-imidazo[1,2-a]pyridin-2-ylphenyl)sulfonylmorpholine::4-[4-(2-imidazo[1,2-a]pyridinyl)phenyl]sulfonylmorpholine::MLS000111470::SMR000107392::cid_696014
SMILES O=S(=O)(N1CCOCC1)c1ccc(cc1)-c1cn2ccccc2n1
InChI Key InChIKey=FAHVTMMXGGKBGO-UHFFFAOYSA-N
Data  1 EC50
  Tab Delimited (TSV)   2D SDfile   Computed 3D by Vconf -m prep SDfile
Find this compound or compounds like it in BindingDB:
Activity Spreadsheet -- Enzyme Inhibition Constant Data from BindingDB
Found 1 hit for monomerid = 100029
TargetKallikrein-7(Homo sapiens (Human))
The Scripps Research Institute Molecular Screening Center
Curated by PubChem BioAssay
LigandPNGBDBM100029(4-(4-imidazo[1,2-a]pyridin-2-ylphenyl)sulfonylmorp...)
Affinity DataEC50: >6.95E+4nM
In DepthDetails PCBioAssay