BDBM10003 1-[(6-Methoxybenzofuran-2-yl)-(4-methoxyphenyl)methyl]-1H-imidazole::1-[(6-methoxy-1-benzofuran-2-yl)(4-methoxyphenyl)methyl]-1H-imidazole::Benzofuran Imidazole Derivative 6
SMILES COc1ccc(cc1)C(c1cc2ccc(OC)cc2o1)n1ccnc1
InChI Key InChIKey=PKSNASDRHDFKQO-UHFFFAOYSA-N
Data  1 IC50
  Tab Delimited (TSV)   2D SDfile   Computed 3D by Vconf -m prep SDfile
Find this compound or compounds like it in BindingDB:
Activity Spreadsheet -- Enzyme Inhibition Constant Data from BindingDB
Found 1 hit for monomerid = 10003
TargetAromatase(Homo sapiens (Human))
Cardiff University
LigandPNGBDBM10003(1-[(6-Methoxybenzofuran-2-yl)-(4-methoxyphenyl)met...)
Affinity DataIC50:  130nMpH: 7.4 T: 2°C. Assay description: The enzyme activity was assayed by measuring the 3H-labeled H2O formed from [1,2,6,7-3H ]androstenedione / androstenedione during aromatization. Afte...
Ligand InfoPC cidPC sid
In DepthDetails ArticlePubMed