BDBM10005 1-[(4-chlorophenyl)(6-methoxy-1-benzofuran-2-yl)methyl]-1H-1,2,4-triazole::1-[(6-Methoxybenzofuran-2-yl)-(4-chlorophenyl)methyl]-1H-1,2,4-triazole::Benzofuran Triazole Derivative 7b
SMILES COc1ccc2cc(oc2c1)C(c1ccc(Cl)cc1)n1cncn1
InChI Key InChIKey=NSSXLAQTZVKYHU-UHFFFAOYSA-N
Data  2 IC50
  Tab Delimited (TSV)   2D SDfile   Computed 3D by Vconf -m prep SDfile
Find this compound or compounds like it in BindingDB:
Activity Spreadsheet -- Enzyme Inhibition Constant Data from BindingDB
Found 2 hits for monomerid = 10005
TargetAromatase(Homo sapiens (Human))
Cardiff University
Curated by ChEMBL
LigandPNGBDBM10005(1-[(4-chlorophenyl)(6-methoxy-1-benzofuran-2-yl)me...)
Affinity DataIC50:  0.470nM. Assay description: Inhibition of aromatase in human JEG-3 cells using Androst-4-ene-3,17-dione as substrate incubated for 1 hr and measured by BCA assay
In DepthDetails PubMed
TargetAromatase(Homo sapiens (Human))
Cardiff University
Curated by ChEMBL
LigandPNGBDBM10005(1-[(4-chlorophenyl)(6-methoxy-1-benzofuran-2-yl)me...)
Affinity DataIC50:  44nMpH: 7.4 T: 2°C. Assay description: The enzyme activity was assayed by measuring the 3H-labeled H2O formed from [1,2,6,7-3H ]androstenedione / androstenedione during aromatization. Afte...
In DepthDetails ArticlePubMed