BDBM10010 1-[(6-Methoxybenzofuran-2-yl)-(4-trifluoromethylphenyl)-methyl]-1H-1,2,4-triazole::1-[(6-methoxy-1-benzofuran-2-yl)[4-(trifluoromethyl)phenyl]methyl]-1H-1,2,4-triazole::Benzofuran Triazole Derivative 7g
SMILES COc1ccc2cc(oc2c1)C(c1ccc(cc1)C(F)(F)F)n1cncn1
InChI Key InChIKey=HZNXQCYACVRDHF-UHFFFAOYSA-N
Data  1 IC50
  Tab Delimited (TSV)   2D SDfile   Computed 3D by Vconf -m prep SDfile
Find this compound or compounds like it in BindingDB:
Activity Spreadsheet -- Enzyme Inhibition Constant Data from BindingDB
Found 1 hit for monomerid = 10010
TargetAromatase(Homo sapiens (Human))
Cardiff University
LigandPNGBDBM10010(1-[(6-Methoxybenzofuran-2-yl)-(4-trifluoromethylph...)
Affinity DataIC50:  130nMpH: 7.4 T: 2°C. Assay description: The enzyme activity was assayed by measuring the 3H-labeled H2O formed from [1,2,6,7-3H ]androstenedione / androstenedione during aromatization. Afte...
In DepthDetails ArticlePubMed