BDBM100202 2-(1-naphthalenyl)acetic acid [2-[(3-carbamoyl-2-thiophenyl)amino]-2-oxoethyl] ester::2-(1-naphthyl)acetic acid [2-[(3-carbamoyl-2-thienyl)amino]-2-keto-ethyl] ester::MLS000566405::SMR000153553::[2-[(3-aminocarbonylthiophen-2-yl)amino]-2-oxidanylidene-ethyl] 2-naphthalen-1-ylethanoate::[2-[(3-carbamoylthiophen-2-yl)amino]-2-oxoethyl] 2-naphthalen-1-ylacetate::cid_2536570
SMILES NC(=O)c1ccsc1NC(=O)COC(=O)Cc1cccc2ccccc12
InChI Key InChIKey=QLTMZWGLVHFRFA-UHFFFAOYSA-N
Data  2 IC50
  Tab Delimited (TSV)   2D SDfile   Computed 3D by Vconf -m prep SDfile
Find this compound or compounds like it in BindingDB:
Activity Spreadsheet -- Enzyme Inhibition Constant Data from BindingDB
Found 2 hits for monomerid = 100202
TargetTegument protein VP16(Human herpesvirus 1 (strain 17) (HHV-1) (Human her...)
The Scripps Research Institute Molecular Screening Center
Curated by PubChem BioAssay
LigandPNGBDBM100202(2-(1-naphthalenyl)acetic acid [2-[(3-carbamoyl-2-t...)
Affinity DataIC50:  8.54E+4nM. Assay description: Source (MLPCN Center Name): The Scripps Research Institute Molecular Screening Center Affiliation: The Scripps Research Institute, TSRI Assay Provide...
In DepthDetails PCBioAssay
TargetCOUP transcription factor 2(Homo sapiens (Human))
The Scripps Research Institute Molecular Screening Center
Curated by PubChem BioAssay
LigandPNGBDBM100202(2-(1-naphthalenyl)acetic acid [2-[(3-carbamoyl-2-t...)
Affinity DataIC50:  1.38E+4nM
In DepthDetails PCBioAssay