BDBM100217 1-[1,1'-biphenyl]-4-yl-2-(4-imino-1(4H)-pyridinyl)ethanone::2-(4-azanylidenepyridin-1-yl)-1-(4-phenylphenyl)ethanone;hydrobromide::2-(4-imino-1-pyridinyl)-1-(4-phenylphenyl)ethanone;hydrobromide::2-(4-imino-1-pyridyl)-1-(4-phenylphenyl)ethanone;hydrobromide::2-(4-iminopyridin-1-yl)-1-(4-phenylphenyl)ethanone;hydrobromide::MLS000698051::SMR000226259::cid_9947479
SMILES N=c1ccn(CC(=O)c2ccc(cc2)-c2ccccc2)cc1
InChI Key InChIKey=YGECTRZNKKYOAY-UHFFFAOYSA-N
Data  2 IC50
  Tab Delimited (TSV)   2D SDfile   Computed 3D by Vconf -m prep SDfile
Find this compound or compounds like it in BindingDB:
Activity Spreadsheet -- Enzyme Inhibition Constant Data from BindingDB
Found 2 hits for monomerid = 100217
TargetTegument protein VP16(Human herpesvirus 1 (strain 17) (HHV-1) (Human her...)
The Scripps Research Institute Molecular Screening Center
Curated by PubChem BioAssay
LigandPNGBDBM100217(1-[1,1'-biphenyl]-4-yl-2-(4-imino-1(4H)-pyridi...)
Affinity DataIC50:  8.54E+4nM. Assay description: Source (MLPCN Center Name): The Scripps Research Institute Molecular Screening Center Affiliation: The Scripps Research Institute, TSRI Assay Provide...
In DepthDetails PCBioAssay
TargetCOUP transcription factor 2(Homo sapiens (Human))
The Scripps Research Institute Molecular Screening Center
Curated by PubChem BioAssay
LigandPNGBDBM100217(1-[1,1'-biphenyl]-4-yl-2-(4-imino-1(4H)-pyridi...)
Affinity DataIC50:  9.15E+3nM
In DepthDetails PCBioAssay