BDBM100231 MLS001214690::SMR000543668::cid_16405308
SMILES [H][C@@]12CCC3(C)OOC11C(CC[C@H]2C)C(C)C(OC(=O)CCC(=O)NCCCC(=O)NC(C(C)CC)C(O)=O)O[C@@]1([H])O3
InChI Key InChIKey=MKLSGYFZQOELAG-GCLPMJKTSA-N
Data  2 IC50
  Tab Delimited (TSV)   2D SDfile   Computed 3D by Vconf -m prep SDfile
Find this compound or compounds like it in BindingDB:
Activity Spreadsheet -- Enzyme Inhibition Constant Data from BindingDB
Found 2 hits for monomerid = 100231
TargetTegument protein VP16(Human herpesvirus 1 (strain 17) (HHV-1) (Human her...)
The Scripps Research Institute Molecular Screening Center
Curated by PubChem BioAssay
LigandPNGBDBM100231(MLS001214690 | SMR000543668 | cid_16405308)
Affinity DataIC50:  8.54E+4nM. Assay description: Source (MLPCN Center Name): The Scripps Research Institute Molecular Screening Center Affiliation: The Scripps Research Institute, TSRI Assay Provide...
In DepthDetails PCBioAssay
TargetCOUP transcription factor 2(Homo sapiens (Human))
The Scripps Research Institute Molecular Screening Center
Curated by PubChem BioAssay
LigandPNGBDBM100231(MLS001214690 | SMR000543668 | cid_16405308)
Affinity DataIC50: >8.54E+4nM
In DepthDetails PCBioAssay