BDBM101050 US8524917, 23
SMILES CC(C)c1c(C(=O)NCc2ccc(F)c(F)c2)c2ccc(OC(=O)C(C)(C)C)cc2n1Cc1ccccc1
InChI Key InChIKey=RAAGFROOKHKCPT-UHFFFAOYSA-N
Data  1 IC50
  Tab Delimited (TSV)   2D SDfile   Computed 3D by Vconf -m prep SDfile
Find this compound or compounds like it in BindingDB:
Activity Spreadsheet -- Enzyme Inhibition Constant Data from BindingDB
Found 1 hit for monomerid = 101050
TargetSphingosine 1-phosphate receptor 3(Homo sapiens (Human))
Allergan
US Patent
LigandPNGBDBM101050(US8524917, 23)
Affinity DataIC50:  4nM. Assay description: Inhibition assay using sphingosine-1-phosphate receptor 3.
In DepthDetails US Patent