BDBM10173 lysine sulfonamide analogue 34::pyridin-4-ylmethyl N-[(1S)-1-{[(5R)-5-[(4-aminobenzene)(2-methylpropyl)sulfonamido]-6-hydroxyhexyl]carbamoyl}-2,2-diphenylethyl]carbamate
SMILES CC(C)CN(C(CO)CCCCNC(=O)[C@@H](NC(=O)OCc1ccncc1)C(c1ccccc1)c1ccccc1)S(=O)(=O)c1ccc(N)cc1
InChI Key InChIKey=PDCGRTGBLXVGJC-CRGCAJGSSA-N
Data  1 KI  1 IC50
  Tab Delimited (TSV)   2D SDfile   Computed 3D by Vconf -m prep SDfile
Find this compound or compounds like it in BindingDB:
Activity Spreadsheet -- Enzyme Inhibition Constant Data from BindingDB
Found 1 hit for monomerid = 10173
TargetDimer of Gag-Pol polyprotein [501-599](Human immunodeficiency virus type 1)
Ambrilia Biopharma
LigandPNGBDBM10173(lysine sulfonamide analogue 34 | pyridin-4-ylmethy...)
Affinity DataKi:  0.0200nM IC50:  0.390nM. Assay description: HIV-1 protease activity was measured by a continuous fluorometric assay. The proteolytic activity can be monitored by the increase in fluorescence in...
In DepthDetails ArticlePubMed