BDBM101825 US9695160, 39::US9796707, Compound 39
SMILES FC(F)(F)c1ccc(N2CCN(Cc3ccccn3)CC2)c(NC(=O)c2ccc(o2)C2CCOCC2)c1
InChI Key InChIKey=HNSUMLIZWHDJBC-UHFFFAOYSA-N
Data  2 IC50
  Tab Delimited (TSV)   2D SDfile   Computed 3D by Vconf -m prep SDfile
Find this compound or compounds like it in BindingDB:
Activity Spreadsheet -- Enzyme Inhibition Constant Data from BindingDB
Found 2 hits for monomerid = 101825
TargetSRSF protein kinase 1(Homo sapiens (Human))
The University Of Nottingham
US Patent
LigandPNGBDBM101825(US9695160, 39 | US9796707, Compound 39)
Affinity DataIC50:  2.60nM. Assay description: Candidate compounds were screened by the Kinase-Glo assay (Promega; Koresawa and Okabe, 2004), the results of which are shown in Table 1 and Table 2....
In DepthDetails US Patent
TargetSRSF protein kinase 1(Homo sapiens (Human))
The University Of Nottingham
US Patent
LigandPNGBDBM101825(US9695160, 39 | US9796707, Compound 39)
Affinity DataIC50:  2.60nMT: 2°C. Assay description: Candidate compounds were screened by the Kinase-Glo assay (Promega; Koresawa and Okabe, 2004), the results of which are shown in Table 1 and Table 2....
In DepthDetails US Patent