BDBM10286 Isoquinoline-1,3,4-trione 13e::N-Phenyl-N-(1,3,4-trioxo-1,2,3,4-tetrahydro-isoquinolin-6-yl)-succinamide::N-phenyl-N'-(1,3,4-trioxo-1,2,3,4-tetrahydroisoquinolin-6-yl)butanediamide
SMILES O=C(CCC(=O)Nc1ccc2C(=O)NC(=O)C(=O)c2c1)Nc1ccccc1
InChI Key InChIKey=IXISFQRCWARIAK-UHFFFAOYSA-N
Data  1 IC50
  Tab Delimited (TSV)   2D SDfile   Computed 3D by Vconf -m prep SDfile
Find this compound or compounds like it in BindingDB:
Activity Spreadsheet -- Enzyme Inhibition Constant Data from BindingDB
Found 1 hit for monomerid = 10286
TargetCaspase-3(Homo sapiens (Human))
Shanghai Institutes For Biological Sciences
LigandPNGBDBM10286(Isoquinoline-1,3,4-trione 13e | N-Phenyl-N-(1,3,4-...)
Affinity DataIC50:  201nM. Assay description: The rate of chromogenic substrate hydrolysis was monitored by the change of absorbance at 405 nm for 3 min. Compounds were tested in duplicate. The I...
In DepthDetails ArticlePubMed