BDBM10291 Isoquinoline-1,3,4-trione 13j::N-(3-Ethoxy-phenyl)-N-(1,3,4-trioxo-1,2,3,4-tetrahydro-isoquinolin-6-yl)-succinamide::N-(3-ethoxyphenyl)-N'-(1,3,4-trioxo-1,2,3,4-tetrahydroisoquinolin-6-yl)butanediamide
SMILES CCOc1cccc(NC(=O)CCC(=O)Nc2ccc3C(=O)NC(=O)C(=O)c3c2)c1
InChI Key InChIKey=DWNPHMGUKDVJTL-UHFFFAOYSA-N
Data  1 IC50
  Tab Delimited (TSV)   2D SDfile   Computed 3D by Vconf -m prep SDfile
Find this compound or compounds like it in BindingDB:
Activity Spreadsheet -- Enzyme Inhibition Constant Data from BindingDB
Found 1 hit for monomerid = 10291
TargetCaspase-3(Homo sapiens (Human))
Shanghai Institutes For Biological Sciences
LigandPNGBDBM10291(Isoquinoline-1,3,4-trione 13j | N-(3-Ethoxy-phenyl...)
Affinity DataIC50:  55nM. Assay description: The rate of chromogenic substrate hydrolysis was monitored by the change of absorbance at 405 nm for 3 min. Compounds were tested in duplicate. The I...
In DepthDetails ArticlePubMed