BDBM103257 US8546389, 111
SMILES CNC(=O)c1n(nc2cc(N(CCCN3CCCCC3)S(C)(=O)=O)c(cc12)C1CC1)-c1ccc(Oc2ccc(F)cc2)cc1
InChI Key InChIKey=OWNWWIIFZNDWJA-UHFFFAOYSA-N
Data  2 IC50
  Tab Delimited (TSV)   2D SDfile   Computed 3D by Vconf -m prep SDfile
Find this compound or compounds like it in BindingDB:
Activity Spreadsheet -- Enzyme Inhibition Constant Data from BindingDB
Found 2 hits for monomerid = 103257
TargetGenome polyprotein(Hepatitis C virus genotype 3a (isolate NZL1) (HCV))
Biota Scientific Management
US Patent
LigandPNGBDBM103257(US8546389, 111)
Affinity DataIC50:  260nM. Assay description: HCV polymerase inhibition assay: HCV polymerase reactions were carried out using a modified mothod of Howe et al., Antimicrobial Agents and Chemothe...
In DepthDetails US Patent
TargetGenome polyprotein(Hepatitis C virus genotype 1b (isolate BK) (HCV))
Biota Scientific Management
US Patent
LigandPNGBDBM103257(US8546389, 111)
Affinity DataIC50:  1.17E+3nM. Assay description: HCV polymerase inhibition assay: HCV polymerase reactions were carried out using a modified mothod of Howe et al., Antimicrobial Agents and Chemothe...
In DepthDetails US Patent