BDBM10337 (S)-1-(6-Fluoro-pyridin-2-yl-methyl)-5-(2-phenoxymethyl-pyrrolidine-1-sulfonyl)-1H-indole-2,3-dione::1-[(6-fluoropyridin-2-yl)methyl]-5-{[(2S)-2-(phenoxymethyl)pyrrolidine-1-]sulfonyl}-2,3-dihydro-1H-indole-2,3-dione::Pyrrolidine Isatin Analogue 11i
SMILES Fc1cccc(CN2C(=O)C(=O)c3cc(ccc23)S(=O)(=O)N2CCC[C@H]2COc2ccccc2)n1
InChI Key InChIKey=FNURIBXCMKMVRL-SFHVURJKSA-N
Data  6 IC50
  Tab Delimited (TSV)   2D SDfile   Computed 3D by Vconf -m prep SDfile
Find this compound or compounds like it in BindingDB:
Activity Spreadsheet -- Enzyme Inhibition Constant Data from BindingDB
Found 6 hits for monomerid = 10337
TargetCaspase-3(Homo sapiens (Human))
Washington University
LigandPNGBDBM10337((S)-1-(6-Fluoro-pyridin-2-yl-methyl)-5-(2-phenoxym...)
Affinity DataIC50:  9.10nMpH: 7.4 T: 2°C. Assay description: The substrate peptides terminating in AMC are processed by caspases with or without inhibitors. The amount of AMC released was determined by using a ...
In DepthDetails ArticlePubMed
TargetCaspase-7(Homo sapiens (Human))
Washington University
LigandPNGBDBM10337((S)-1-(6-Fluoro-pyridin-2-yl-methyl)-5-(2-phenoxym...)
Affinity DataIC50:  22.2nM. Assay description: The substrate peptides terminating in AMC are processed by caspases with or without inhibitors. The amount of AMC released was determined by using a ...
In DepthDetails ArticlePubMed
TargetCaspase-3(Homo sapiens (Human))
Washington University
LigandPNGBDBM10337((S)-1-(6-Fluoro-pyridin-2-yl-methyl)-5-(2-phenoxym...)
Affinity DataIC50:  9.12nM. Assay description: Inhibition of caspase3
In DepthDetails ArticlePubMed
TargetCaspase-6(Homo sapiens (Human))
Washington University
LigandPNGBDBM10337((S)-1-(6-Fluoro-pyridin-2-yl-methyl)-5-(2-phenoxym...)
Affinity DataIC50: >5.00E+3nM. Assay description: The substrate peptides terminating in AMC are processed by caspases with or without inhibitors. The amount of AMC released was determined by using a ...
In DepthDetails ArticlePubMed
TargetCaspase-8(Homo sapiens (Human))
Washington University
LigandPNGBDBM10337((S)-1-(6-Fluoro-pyridin-2-yl-methyl)-5-(2-phenoxym...)
Affinity DataIC50: >5.00E+4nM. Assay description: The substrate peptides terminating in AMC are processed by caspases with or without inhibitors. The amount of AMC released was determined by using a ...
In DepthDetails ArticlePubMed
TargetCaspase-1(Homo sapiens (Human))
Washington University
LigandPNGBDBM10337((S)-1-(6-Fluoro-pyridin-2-yl-methyl)-5-(2-phenoxym...)
Affinity DataIC50: >5.00E+4nM. Assay description: The substrate peptides terminating in AMC are processed by caspases with or without inhibitors. The amount of AMC released was determined by using a ...
In DepthDetails ArticlePubMed