BDBM103576 ATX inhibitor 10 analogue 6
SMILES OB(O)c1ccc(CN2CCN(CC2)C2=NC(=O)\C(S2)=C\c2ccc(Cl)c(Cl)c2)cc1
InChI Key InChIKey=CKUAZJLGUCZSNN-UNOMPAQXSA-N
Data  1 IC50
PDB links: 1 PDB ID matches this monomer.
  Tab Delimited (TSV)   2D SDfile   Computed 3D by Vconf -m prep SDfile
Find this compound or compounds like it in BindingDB:
Activity Spreadsheet -- Enzyme Inhibition Constant Data from BindingDB
Found 1 hit for monomerid = 103576
TargetEctonucleotide pyrophosphatase/phosphodiesterase family member 2(Mus musculus)
The University Of Tokyo
LigandPNGBDBM103576(ATX inhibitor 10 analogue 6)
Affinity DataIC50:  22nM