BDBM103954 US8569521, 292
SMILES O[C@@]12COc3c(F)ccc(F)c3[C@@]1(CC[C@H](C2)NS(=O)(=O)C1CC1)S(=O)(=O)c1ccc(Cl)cc1
InChI Key InChIKey=XDAUFESNWZKCLQ-YKAGIRRDSA-N
Data  1 IC50
  Tab Delimited (TSV)   2D SDfile   Computed 3D by Vconf -m prep SDfile
Find this compound or compounds like it in BindingDB:
Activity Spreadsheet -- Enzyme Inhibition Constant Data from BindingDB
Found 1 hit for monomerid = 103954
TargetAmyloid-beta precursor protein(Homo sapiens (Human))
Merck Sharp & Dohme
US Patent
LigandPNGBDBM103954(US8569521, 292)
Affinity DataIC50:  29nM. Assay description: Gamma-secretase activity was determined as described by Zhang et al. (Biochemistry, 40(16), 5049-5055, 2001).
In DepthDetails US Patent