BDBM103989 LecB Inhibitor Triazoles 2g
SMILES COC1O[C@H](Cn2cc(nn2)-c2ccc(F)cc2)[C@@H](O)C(O)[C@@H]1O
InChI Key InChIKey=ZJYXJVBISGKPLG-HIKVSJJOSA-N
Data  1 IC50
  Tab Delimited (TSV)   2D SDfile   Computed 3D by Vconf -m prep SDfile
Find this compound or compounds like it in BindingDB:
Activity Spreadsheet -- Enzyme Inhibition Constant Data from BindingDB
Found 1 hit for monomerid = 103989
TargetFucose-binding lectin PA-IIL(Pseudomonas aeruginosa)
University Of Konstanz
LigandPNGBDBM103989(LecB Inhibitor Triazoles 2g)
Affinity DataIC50:  2.40E+5nM
In DepthDetails ArticlePubMed