BDBM103996 LecB Inhibitor Amides 4g
SMILES COC1O[C@H](CNC(=O)\C=C\c2ccccc2)[C@@H](O)C(O)[C@@H]1O
InChI Key InChIKey=LHFOPICMJLPBDI-YPLIVNEISA-N
Data  1 IC50  1 Kd
  Tab Delimited (TSV)   2D SDfile   Computed 3D by Vconf -m prep SDfile
Find this compound or compounds like it in BindingDB:
Activity Spreadsheet -- Enzyme Inhibition Constant Data from BindingDB
Found 1 hit for monomerid = 103996
TargetFucose-binding lectin PA-IIL(Pseudomonas aeruginosa)
University Of Konstanz
LigandPNGBDBM103996(LecB Inhibitor Amides 4g)
Affinity DataIC50:  3.74E+4nM Kd:  1.85E+4nM
In DepthDetails ArticlePubMed