BDBM104233 US8575145, 110
SMILES COc1ccc2nnc(-c3ccc4cc(F)cc(OCC5(F)CCNCC5)c4n3)n2c1
InChI Key InChIKey=LSRFJFLUAZLYAC-UHFFFAOYSA-N
Data  2 IC50
  Tab Delimited (TSV)   2D SDfile   Computed 3D by Vconf -m prep SDfile
Find this compound or compounds like it in BindingDB:
Activity Spreadsheet -- Enzyme Inhibition Constant Data from BindingDB
Found 2 hits for monomerid = 104233
TargetSerine/threonine-protein kinase pim-2(Homo sapiens (Human))
Array Biopharma
US Patent
LigandPNGBDBM104233(US8575145, 110)
Affinity DataIC50:  163nMpH: 7.4 T: 2°C. Assay description: The assay for the determination of PIM activity is based on the incorporation of [33P] ATP into PIM2tide substrate and capture of the radiolabeled pe...
In DepthDetails US Patent
TargetSerine/threonine-protein kinase pim-1(Homo sapiens (Human))
Array Biopharma
US Patent
LigandPNGBDBM104233(US8575145, 110)
Affinity DataIC50:  1.90nMpH: 7.4 T: 2°C. Assay description: The assay for the determination of PIM activity is based on the incorporation of [33P] ATP into PIM2tide substrate and capture of the radiolabeled pe...
In DepthDetails US Patent