BDBM105234 US8580782, 1
SMILES Brc1cnn2c(NCc3ccncc3)cc(nc12)-c1ccccc1
InChI Key InChIKey=JECHSYMSTXETFI-UHFFFAOYSA-N
Data  2 IC50
PDB links: 1 PDB ID matches this monomer.
  Tab Delimited (TSV)   2D SDfile   Computed 3D by Vconf -m prep SDfile
Find this compound or compounds like it in BindingDB:
Activity Spreadsheet -- Enzyme Inhibition Constant Data from BindingDB
Found 2 hits for monomerid = 105234
TargetCyclin-dependent kinase 2(Homo sapiens (Human))
Merck Sharp & Dohme
US Patent
LigandPNGBDBM105234(US8580782, 1)
Affinity DataIC50:  29nMpH: 8.0Assay Description:CDK2 kinase assays (either cyclin A or cyclin E-dependent) were performed in low protein binding 96-well plates (Corning Inc., Corning, N.Y.).
TargetCyclin-dependent kinase 2(Homo sapiens (Human))
Merck Sharp & Dohme
US Patent
LigandPNGBDBM105234(US8580782, 1)
Affinity DataIC50:  20nMpH: 8.0Assay Description:CDK2 kinase assays (either cyclin A or cyclin E-dependent) were performed in low protein binding 96-well plates (Corning Inc., Corning, N.Y.).