BDBM10538 (3S)-5-(benzylsulfanyl)-3-[(2S)-2-[(2S)-2-hydroxy-2-phenylacetamido]-3-methylbutanamido]-4-oxopentanoic acid::valine aspartyl ketone 17
SMILES CC(C)[C@H](NC(=O)[C@@H](O)c1ccccc1)C(=O)N[C@@H](CC(O)=O)C(=O)CSCc1ccccc1
InChI Key InChIKey=WSQQNURYWZYILE-VJBMBRPKSA-N
Data  4 IC50
  Tab Delimited (TSV)   2D SDfile   Computed 3D by Vconf -m prep SDfile
Find this compound or compounds like it in BindingDB:
Activity Spreadsheet -- Enzyme Inhibition Constant Data from BindingDB
Found 4 hits for monomerid = 10538
TargetCaspase-3(Homo sapiens (Human))
Merck Frosst Canada
LigandPNGBDBM10538((3S)-5-(benzylsulfanyl)-3-[(2S)-2-[(2S)-2-hydroxy-...)
Affinity DataIC50:  100nMpH: 7.0 T: 2°C. Assay description: The substrate peptides terminating in AMC are processed by caspases with or without inhibitors, and the accumulation of AMC was assessed with a Cytof...
In DepthDetails ArticlePubMed
TargetCaspase-8(Homo sapiens (Human))
Merck Frosst Canada
LigandPNGBDBM10538((3S)-5-(benzylsulfanyl)-3-[(2S)-2-[(2S)-2-hydroxy-...)
Affinity DataIC50:  3.65E+3nM. Assay description: The substrate peptides terminating in AMC are processed by caspases with or without inhibitors, and the accumulation of AMC was assessed with a Cytof...
In DepthDetails ArticlePubMed
TargetCaspase-7(Homo sapiens (Human))
Merck Frosst Canada
LigandPNGBDBM10538((3S)-5-(benzylsulfanyl)-3-[(2S)-2-[(2S)-2-hydroxy-...)
Affinity DataIC50:  1.09E+4nM. Assay description: The substrate peptides terminating in AMC are processed by caspases with or without inhibitors, and the accumulation of AMC was assessed with a Cytof...
In DepthDetails ArticlePubMed
TargetCaspase-1(Homo sapiens (Human))
Merck Frosst Canada
LigandPNGBDBM10538((3S)-5-(benzylsulfanyl)-3-[(2S)-2-[(2S)-2-hydroxy-...)
Affinity DataIC50:  4.06E+3nM. Assay description: The substrate peptides terminating in AMC are processed by caspases with or without inhibitors, and the accumulation of AMC was assessed with a Cytof...
In DepthDetails ArticlePubMed