BDBM106607 US8586617, 110
SMILES CC(C)Oc1cccc(c1)N(Cc1cnc[nH]1)C(C)C
InChI Key InChIKey=LGRYUHRNNHEDNK-UHFFFAOYSA-N
Data  1 KI
  Tab Delimited (TSV)   2D SDfile   Computed 3D by Vconf -m prep SDfile
Find this compound or compounds like it in BindingDB:
Activity Spreadsheet -- Enzyme Inhibition Constant Data from BindingDB
Found 1 hit for monomerid = 106607
TargetTrace amine-associated receptor 1(Mus musculus (Mouse))
Hoffmann-La Roche
US Patent
LigandPNGBDBM106607(US8586617, 110)
Affinity DataKi:  6.70nM ΔG°:  -10.4kcal/moleT: 2°C. Assay description: Radioligand binding assay: The radioligand [3H]-rac-2-(1,2,3,4-tetrahydro-1-naphthyl)-2-imidazoline was used at a concentration equal to the calcula...
In DepthDetails US Patent