BDBM107066 US8592432, 50
SMILES COc1cc(C2CCNCC2)c(C)cc1Nc1nc(Nc2ccccc2S(=O)(=O)C(C)C)c2c(C)[nH]nc2n1
InChI Key InChIKey=MTVITDZMXJRGLD-UHFFFAOYSA-N
Data  1 IC50
  Tab Delimited (TSV)   2D SDfile   Computed 3D by Vconf -m prep SDfile
Find this compound or compounds like it in BindingDB:
Activity Spreadsheet -- Enzyme Inhibition Constant Data from BindingDB
Found 1 hit for monomerid = 107066
TargetALK tyrosine kinase receptor(Homo sapiens (Human))
TBA
US Patent
LigandPNGBDBM107066(US8592432, 50)
Affinity DataIC50:  12nM. Assay description: The inhibition of ALK tyrosine kinase activity may be demonstrated using known methods, for example using the recombinant kinase domain of the ALK in...
In DepthDetails US Patent