BDBM107067 US8592432, 52
SMILES CC(C)Oc1cc(C2CCN(CCC(N)=O)CC2)c(C)cc1Nc1nc(Nc2ccccc2S(=O)(=O)C(C)C)c2c(C)[nH]nc2n1
InChI Key InChIKey=AVRZUHVLJADOIN-UHFFFAOYSA-N
Data  1 IC50
  Tab Delimited (TSV)   2D SDfile   Computed 3D by Vconf -m prep SDfile
Find this compound or compounds like it in BindingDB:
Activity Spreadsheet -- Enzyme Inhibition Constant Data from BindingDB
Found 1 hit for monomerid = 107067
TargetALK tyrosine kinase receptor(Homo sapiens (Human))
TBA
US Patent
LigandPNGBDBM107067(US8592432, 52)
Affinity DataIC50:  18nM. Assay description: The inhibition of ALK tyrosine kinase activity may be demonstrated using known methods, for example using the recombinant kinase domain of the ALK in...
In DepthDetails US Patent