BDBM10821 3-[2-(prop-2-yn-1-ylamino)propyl]phenyl N-cyclohexyl-N-methylcarbamate::Phenethylamine deriv. 52e
SMILES CC(Cc1cccc(OC(=O)N(C)C2CCCCC2)c1)NCC#C
InChI Key InChIKey=SHYBFEOFEFSCKU-UHFFFAOYSA-N
Data  3 IC50
  Tab Delimited (TSV)   2D SDfile   Computed 3D by Vconf -m prep SDfile
Find this compound or compounds like it in BindingDB:
Activity Spreadsheet -- Enzyme Inhibition Constant Data from BindingDB
Found 3 hits for monomerid = 10821
TargetAcetylcholinesterase(Homo sapiens (Human))
Teva Pharmaceutical Industries
LigandPNGBDBM10821(3-[2-(prop-2-yn-1-ylamino)propyl]phenyl N-cyclohex...)
Affinity DataIC50:  3.60E+3nM. Assay description: The cholinesterase assays were performed using colorimetric method reported by Ellman. The absorbance changes at 412 nm were recorded for 5 min with ...
In DepthDetails ArticlePubMed
TargetAmine oxidase [flavin-containing] B(Rattus norvegicus (rat))
Teva Pharmaceutical Industries
LigandPNGBDBM10821(3-[2-(prop-2-yn-1-ylamino)propyl]phenyl N-cyclohex...)
Affinity DataIC50:  230nM. Assay description: Inhibition of MAO activity was determined by a radiometric procedure from Tipton and Youdim. Homogenized rat brain was used as the source of enzymes....
In DepthDetails ArticlePubMed
TargetAmine oxidase [flavin-containing] A(Rattus norvegicus (rat))
Teva Pharmaceutical Industries
LigandPNGBDBM10821(3-[2-(prop-2-yn-1-ylamino)propyl]phenyl N-cyclohex...)
Affinity DataIC50:  1.80E+4nM. Assay description: Inhibition of MAO activity was determined by a radiometric procedure from Tipton and Youdim. Homogenized rat brain was used as the source of enzymes....
In DepthDetails ArticlePubMed