BDBM108315 US8604046, 95
SMILES C[C@H]1CCCN1C1CCN(CC1)c1ccc(N2CCC3(CCN(CC4CC4)CC3)C2=O)c(F)c1
InChI Key InChIKey=QQBVWFYKJQXXBM-NRFANRHFSA-N
Data  1 KI
  Tab Delimited (TSV)   2D SDfile   Computed 3D by Vconf -m prep SDfile
Find this compound or compounds like it in BindingDB:
Activity Spreadsheet -- Enzyme Inhibition Constant Data from BindingDB
Found 1 hit for monomerid = 108315
TargetHistamine H3 receptor(Macaca mulatta (Rhesus macaque))
Sanofi
US Patent
LigandPNGBDBM108315(US8604046, 95)
Affinity DataKi:  0.0400nM. Assay description: The compounds of this invention have been demonstrated to displace [3H]- methylhistamine radioligand binding to mammalian cell membranes expressing r...
In DepthDetails US Patent