BDBM109414 US8604061, 136
SMILES C[C@@]1(COC(N)=N1)c1ccc(Cl)cc1
InChI Key InChIKey=VZOGKCVGSMEJJW-SNVBAGLBSA-N
Data  1 KI
  Tab Delimited (TSV)   2D SDfile   Computed 3D by Vconf -m prep SDfile
Find this compound or compounds like it in BindingDB:
Activity Spreadsheet -- Enzyme Inhibition Constant Data from BindingDB
Found 1 hit for monomerid = 109414
TargetTrace amine-associated receptor 1(Mus musculus (Mouse))
Hoffmann-La Roche
US Patent
LigandPNGBDBM109414(US8604061, 136)
Affinity DataKi:  3.80nM. Assay description: Radioligand binding assay using TAAR1.
In DepthDetails US Patent