BDBM109705 US8609715, B-62
SMILES NC(=N)c1ccc(OC(=O)c2ccc(CCC(=O)N[C@@H](CCC(O)=O)C(O)=O)s2)c(F)c1
InChI Key InChIKey=YIJFGJUDHTTZSG-ZDUSSCGKSA-N
Data  2 KI
  Tab Delimited (TSV)   2D SDfile   Computed 3D by Vconf -m prep SDfile
Find this compound or compounds like it in BindingDB:
Activity Spreadsheet -- Enzyme Inhibition Constant Data from BindingDB
Found 2 hits for monomerid = 109705
TargetSerine protease 1(Homo sapiens (Human))
Ajinomoto
US Patent
LigandPNGBDBM109705(US8609715, B-62)
Affinity DataKi:  0.400nM. Assay description: Inhibition assay using human trysin.
In DepthDetails US Patent
TargetEnteropeptidase(Homo sapiens (Human))
Ajinomoto
US Patent
LigandPNGBDBM109705(US8609715, B-62)
Affinity DataKi:  0.570nM. Assay description: Inhibition assay using human enteropeptidase.
In DepthDetails US Patent