BDBM11108 (2S)-1-{[(2S,5R)-5-{[(6-bromo-2H-1,3-benzodioxol-5-yl)oxy]methyl}pyrrolidin-2-yl]carbonyl}pyrrolidine-2-carbonitrile::2-cyanopyrrolidine 21ao
SMILES Brc1cc2OCOc2cc1OC[C@H]1CC[C@H](N1)C(=O)N1CCC[C@H]1C#N
InChI Key InChIKey=PMNATTMIHZLSBV-DYEKYZERSA-N
Data  1 KI
  Tab Delimited (TSV)   2D SDfile   Computed 3D by Vconf -m prep SDfile
Find this compound or compounds like it in BindingDB:
Activity Spreadsheet -- Enzyme Inhibition Constant Data from BindingDB
Found 1 hit for monomerid = 11108
TargetDipeptidyl peptidase 4(Homo sapiens (Human))
Abbott Laboratories
LigandPNGBDBM11108((2S)-1-{[(2S,5R)-5-{[(6-bromo-2H-1,3-benzodioxol-5...)
Affinity DataKi:  0.410nM. Assay description: The DPP4 activity resulted in the formation of the fluorescent product amidomethylcoumarin (AMC), which was monitored by excitation at 355 nm and mea...
In DepthDetails ArticlePubMed