BDBM11235 Anilide Inhibitor 3d::tert-butyl N-[(1S)-1-{[(1S)-1-{[(1S)-1-[(2-chloro-4-nitrophenyl)carbamoyl]-2-phenylethyl]carbamoyl}-3-methylbutyl]carbamoyl}-2-methylpropyl]carbamate
SMILES CC(C)C[C@H](NC(=O)[C@@H](NC(=O)OC(C)(C)C)C(C)C)C(=O)N[C@@H](Cc1ccccc1)C(=O)Nc1ccc(cc1Cl)[N+]([O-])=O
InChI Key InChIKey=ONKANJYUPWHECL-GSDHBNRESA-N
Data  1 IC50
  Tab Delimited (TSV)   2D SDfile   Computed 3D by Vconf -m prep SDfile
Find this compound or compounds like it in BindingDB:
Activity Spreadsheet -- Enzyme Inhibition Constant Data from BindingDB
Found 1 hit for monomerid = 11235
TargetReplicase polyprotein 1ab(Human SARS coronavirus (SARS-CoV) (Severe acute re...)
National Taiwan University
LigandPNGBDBM11235(Anilide Inhibitor 3d | tert-butyl N-[(1S)-1-{[(1S)...)
Affinity DataIC50: >1.00E+4nMpH: 7.0 T: 2°C. Assay description: The effects of compound on enzyme activity were measured by using a fluorogenic peptide cleavage assay. Enhanced fluorescence caused by cleavage of t...
In DepthDetails ArticlePubMed