BDBM11257 AG7088 analogue 4c::ethyl (2E,4S)-4-[(2S)-2-[(2S)-3-methyl-2-[(5-methyl-1,2-oxazol-3-yl)formamido]butanamido]-3-phenylpropanamido]-5-phenylpent-2-enoate
SMILES CCOC(=O)\C=C\[C@H](Cc1ccccc1)NC(=O)[C@H](Cc1ccccc1)NC(=O)[C@@H](NC(=O)c1cc(C)on1)C(C)C
InChI Key InChIKey=DECFOJTYZGEZPC-RWBCRXJQSA-N
Data  1 IC50
  Tab Delimited (TSV)   2D SDfile   Computed 3D by Vconf -m prep SDfile
Find this compound or compounds like it in BindingDB:
Activity Spreadsheet -- Enzyme Inhibition Constant Data from BindingDB
Found 1 hit for monomerid = 11257
TargetReplicase polyprotein 1ab(Human SARS coronavirus (SARS-CoV) (Severe acute re...)
National Taiwan University
LigandPNGBDBM11257(AG7088 analogue 4c | ethyl (2E,4S)-4-[(2S)-2-[(2S)...)
Affinity DataIC50:  3.00E+4nMpH: 7.0 T: 2°C. Assay description: The effects of compound on enzyme activity were measured by using a fluorogenic peptide cleavage assay. Enhanced fluorescence caused by cleavage of t...
In DepthDetails ArticlePubMed