BDBM11269 N-(4-chlorophenyl)-2-{[4-(3-phenyl-1,2-oxazol-5-yl)pyrimidin-2-yl]sulfanyl}acetamide::acs.jmedchem.1c00409_ST.568::jm5b01461, Compound 110::pyrimidine-containing compound 6
SMILES Clc1ccc(NC(=O)CSc2nccc(n2)-c2cc(no2)-c2ccccc2)cc1
InChI Key InChIKey=TUBDEXWKZSAMKH-UHFFFAOYSA-N
Data  3 IC50
  Tab Delimited (TSV)   2D SDfile   Computed 3D by Vconf -m prep SDfile
Find this compound or compounds like it in BindingDB:
Activity Spreadsheet -- Enzyme Inhibition Constant Data from BindingDB
Found 3 hits for monomerid = 11269
TargetReplicase polyprotein 1ab(Human SARS coronavirus (SARS-CoV) (Severe acute re...)
National Tsing Hua University
LigandPNGBDBM11269(N-(4-chlorophenyl)-2-{[4-(3-phenyl-1,2-oxazol-5-yl...)
Affinity DataIC50:  1.50E+4nMpH: 7.0 T: 2°C. Assay description: The effects of compound on enzyme activity were measured by using a fluorogenic peptide cleavage assay. Enhanced fluorescence caused by cleavage of t...
In DepthDetails ArticlePubMed
TargetReplicase polyprotein 1ab(Human SARS coronavirus (SARS-CoV) (Severe acute re...)
National Tsing Hua University
LigandPNGBDBM11269(N-(4-chlorophenyl)-2-{[4-(3-phenyl-1,2-oxazol-5-yl...)
Affinity DataIC50:  1.50E+4nM. Assay description: This is a review article. Please point to the original journal.
In DepthDetails ArticlePubMed
TargetReplicase polyprotein 1ab(Human SARS coronavirus (SARS-CoV) (Severe acute re...)
National Tsing Hua University
LigandPNGBDBM11269(N-(4-chlorophenyl)-2-{[4-(3-phenyl-1,2-oxazol-5-yl...)
Affinity DataIC50:  1.50E+4nM. Assay description: This is a review article.
In DepthDetails ArticlePubMed