BDBM11296 2-(benzenesulfonyl)-4,6-dimethyl-5-nitropyridine-3-carbonitrile::Compound 1 analog 7::acs.jmedchem.1c00409_ST.545::cid_2726174
SMILES Cc1nc(c(C#N)c(C)c1[N+]([O-])=O)S(=O)(=O)c1ccccc1
InChI Key InChIKey=JLRPBEAXLCQKGS-UHFFFAOYSA-N
Data  4 IC50  1 EC50
  Tab Delimited (TSV)   2D SDfile   Computed 3D by Vconf -m prep SDfile
Find this compound or compounds like it in BindingDB:
Activity Spreadsheet -- Enzyme Inhibition Constant Data from BindingDB
Found 5 hits for monomerid = 11296
TargetReplicase polyprotein 1ab(Human SARS coronavirus (SARS-CoV) (Severe acute re...)
National Defense Medical Center
LigandPNGBDBM11296(2-(benzenesulfonyl)-4,6-dimethyl-5-nitropyridine-3...)
Affinity DataIC50:  1.30E+4nMpH: 7.0 T: 2°C. Assay description: The effects of compound on enzyme activity were measured by using a fluorogenic peptide cleavage assay. Enhanced fluorescence caused by cleavage of t...
In DepthDetails ArticlePubMed
TargetVacuolar aminopeptidase 1(Saccharomyces cerevisiae)
Nmmlsc
Curated by PubChem BioAssay
LigandPNGBDBM11296(2-(benzenesulfonyl)-4,6-dimethyl-5-nitropyridine-3...)
Affinity DataEC50:  6.31E+3nM. Assay description: University of New Mexico Assay Overview: Assay Support: 1R03 MH086450-01 Project Title: Chemical Screen of TOR pathway GFP fusion proteins in S. ...
In DepthDetails PCBioAssay
TargetReplicase polyprotein 1ab(Human SARS coronavirus (SARS-CoV) (Severe acute re...)
National Defense Medical Center
LigandPNGBDBM11296(2-(benzenesulfonyl)-4,6-dimethyl-5-nitropyridine-3...)
Affinity DataIC50:  1.30E+4nM. Assay description: This is a review article. Please point to the original journal.
In DepthDetails ArticlePubMed
TargetC-C chemokine receptor type 6(Homo sapiens (Human))
Burnham Center For Chemical Genomics
Curated by PubChem BioAssay
LigandPNGBDBM11296(2-(benzenesulfonyl)-4,6-dimethyl-5-nitropyridine-3...)
Affinity DataIC50: >6.66E+4nM. Assay description: Data Source: Sanford-Burnham Center for Chemical Genomics (SBCCG) Source Affiliation: Sanford-Burnham Medical Research Institute(SBMRI, San Diego, CA...
In DepthDetails PCBioAssay
TargetBeta-galactosidase(Escherichia coli)
Burnham Center For Chemical Genomics
Curated by PubChem BioAssay
LigandPNGBDBM11296(2-(benzenesulfonyl)-4,6-dimethyl-5-nitropyridine-3...)
Affinity DataIC50: >6.66E+4nM. Assay description: Data Source: Sanford-Burnham Center for Chemical Genomics (SBCCG) Source Affiliation: Sanford-Burnham Medical Research Institute(SBMRI, San Diego, C...
In DepthDetails PCBioAssay