BDBM11307 Compound 2 analog 18::N-{4-[(4-chlorobenzene)sulfonyl]-3-(methylsulfanyl)-1H-pyrazol-5-yl}thiophene-2-carboxamide::acs.jmedchem.1c00409_ST.566
SMILES CSc1n[nH]c(NC(=O)c2cccs2)c1S(=O)(=O)c1ccc(Cl)cc1
InChI Key InChIKey=WTTWXUFEJVILJY-UHFFFAOYSA-N
Data  2 IC50
  Tab Delimited (TSV)   2D SDfile   Computed 3D by Vconf -m prep SDfile
Find this compound or compounds like it in BindingDB:
Activity Spreadsheet -- Enzyme Inhibition Constant Data from BindingDB
Found 2 hits for monomerid = 11307
TargetReplicase polyprotein 1ab(Human SARS coronavirus (SARS-CoV) (Severe acute re...)
Michigan State University
LigandPNGBDBM11307(Compound 2 analog 18 | N-{4-[(4-chlorobenzene)sulf...)
Affinity DataIC50:  1.50E+4nM. Assay description: This is a review article. Please point to the original journal.
In DepthDetails ArticlePubMed
TargetReplicase polyprotein 1ab(Human SARS coronavirus (SARS-CoV) (Severe acute re...)
Michigan State University
LigandPNGBDBM11307(Compound 2 analog 18 | N-{4-[(4-chlorobenzene)sulf...)
Affinity DataIC50:  1.50E+4nM. Assay description: The effects of compound on enzyme activity were measured by using a fluorogenic peptide cleavage assay. Enhanced fluorescence caused by cleavage of t...
In DepthDetails ArticlePubMed