BDBM11310 4-(5-chlorothiophen-2-yl)-2-[(thiophene-2-sulfonyl)methyl]-1,3-thiazole hydrobromide::Compound 2 analog 21::acs.jmedchem.1c00409_ST.592
SMILES Clc1ccc(s1)-c1csc(CS(=O)(=O)c2cccs2)n1
InChI Key InChIKey=RNWCXVNZHBPXSO-UHFFFAOYSA-N
Data  2 IC50
  Tab Delimited (TSV)   2D SDfile   Computed 3D by Vconf -m prep SDfile
Find this compound or compounds like it in BindingDB:
Activity Spreadsheet -- Enzyme Inhibition Constant Data from BindingDB
Found 2 hits for monomerid = 11310
TargetReplicase polyprotein 1ab(Human SARS coronavirus (SARS-CoV) (Severe acute re...)
Michigan State University
LigandPNGBDBM11310(4-(5-chlorothiophen-2-yl)-2-[(thiophene-2-sulfonyl...)
Affinity DataIC50:  1.80E+4nM. Assay description: This is a review article. Please point to the original journal.
In DepthDetails ArticlePubMed
TargetReplicase polyprotein 1ab(Human SARS coronavirus (SARS-CoV) (Severe acute re...)
Michigan State University
LigandPNGBDBM11310(4-(5-chlorothiophen-2-yl)-2-[(thiophene-2-sulfonyl...)
Affinity DataIC50:  1.80E+4nM. Assay description: The effects of compound on enzyme activity were measured by using a fluorogenic peptide cleavage assay. Enhanced fluorescence caused by cleavage of t...
In DepthDetails ArticlePubMed