BDBM113719 US8637507, C-3
SMILES CCC1CN(C(=O)Nc2ccccc2)c2ccc(cc2O1)-c1ccc(OCC(C)(C)C(O)=O)nc1
InChI Key InChIKey=AQCJSILNHNZZTF-UHFFFAOYSA-N
Data  4 IC50
  Tab Delimited (TSV)   2D SDfile   Computed 3D by Vconf -m prep SDfile
Find this compound or compounds like it in BindingDB:
Activity Spreadsheet -- Enzyme Inhibition Constant Data from BindingDB
Found 4 hits for monomerid = 113719
TargetDiacylglycerol O-acyltransferase 1(Homo sapiens (Human))
Merck Sharp & Dohme
US Patent
LigandPNGBDBM113719(US8637507, C-3)
Affinity DataIC50:  131nMT: 2°C. Assay description: The in vitro assay to identify DGAT1 inhibitors uses human DGAT1 enzyme expressed in Sf9 insect cells prepared as microsomes. The reaction was initia...
In DepthDetails US Patent
TargetDiacylglycerol O-acyltransferase 1(Homo sapiens (Human))
Merck Sharp & Dohme
US Patent
LigandPNGBDBM113719(US8637507, C-3)
Affinity DataIC50:  100nM. Assay description: Inhibition of human DGAT1 expressed in Sf9 insect cells using 1,2-dioleoyl-sn-glycerol and [14C]-palmitoyl-CoA substrate by scintillation counting an...
In DepthDetails ArticlePubMed
TargetDiacylglycerol O-acyltransferase 1(Mus musculus (mouse))
Merck Research Laboratories
Curated by ChEMBL
LigandPNGBDBM113719(US8637507, C-3)
Affinity DataIC50:  73nM. Assay description: Inhibition of mouse DGAT1 expressed in Sf9 insect cells using 1,2-dioleoyl-sn-glycerol and [14C]-palmitoyl-CoA substrate by scintillation counting an...
In DepthDetails ArticlePubMed
TargetCytochrome P450 2C9(Homo sapiens (Human))
Merck Research Laboratories
Curated by ChEMBL
LigandPNGBDBM113719(US8637507, C-3)
Affinity DataIC50:  500nM. Assay description: Inhibition of CYP2C9 (unknown origin)
In DepthDetails ArticlePubMed