BDBM114375 2-[[2-[(3-ethyl-8-methyl-2-quinolinyl)thio]-1-oxoethyl]amino]acetic acid ethyl ester::2-[[2-[(3-ethyl-8-methyl-2-quinolyl)thio]acetyl]amino]acetic acid ethyl ester::MLS000692883::SMR000285556::cid_3207945::ethyl 2-[2-(3-ethyl-8-methyl-quinolin-2-yl)sulfanylethanoylamino]ethanoate::ethyl 2-[[2-(3-ethyl-8-methylquinolin-2-yl)sulfanylacetyl]amino]acetate
SMILES CCOC(=O)CNC(=O)CSc1nc2c(C)cccc2cc1CC
InChI Key InChIKey=NUNBAOSRSNHECU-UHFFFAOYSA-N
Data  1 IC50
  Tab Delimited (TSV)   2D SDfile   Computed 3D by Vconf -m prep SDfile
Find this compound or compounds like it in BindingDB:
Activity Spreadsheet -- Enzyme Inhibition Constant Data from BindingDB
Found 1 hit for monomerid = 114375
TargetMajor prion protein(Homo sapiens (Human))
The Scripps Research Institute Molecular Screening Center
Curated by PubChem BioAssay
LigandPNGBDBM114375(2-[[2-[(3-ethyl-8-methyl-2-quinolinyl)thio]-1-oxoe...)
Affinity DataIC50:  2.76E+3nM. Assay description: Source (MLPCN Center Name): The Scripps Research Institute Molecular Screening Center (SRIMSC) Affiliation: The Scripps Research Institute, TSRI Assa...
In DepthDetails PCBioAssay