BDBM1181 N-(3-{cyclopropyl[6-(1,3-dicyclopropylpropan-2-yl)-4-hydroxy-2-oxo-2H-pyran-3-yl]methyl}phenyl)benzenesulfonamide::N-[3-[Cyclopropyl[6-[2-cyclopropyl-1-(cyclopropyl-methyl)ethyl]-4-hydroxy-2-oxo-2H-pyran-3-yl]methyl]phenyl]benzenesulfonamide::Sulfonamide-Containing 4-Hydroxy-2-pyrone deriv. XXI
SMILES Oc1cc(oc(=O)c1C(C1CC1)c1cccc(NS(=O)(=O)c2ccccc2)c1)C(CC1CC1)CC1CC1
InChI Key InChIKey=WABOALMCZNGCSN-UHFFFAOYSA-N
Data  1 KI
  Tab Delimited (TSV)   2D SDfile   Computed 3D by Vconf -m prep SDfile
Find this compound or compounds like it in BindingDB:
Activity Spreadsheet -- Enzyme Inhibition Constant Data from BindingDB
Found 1 hit for monomerid = 1181
TargetDimer of Gag-Pol polyprotein [489-587](Human immunodeficiency virus type 1)
Upjohn
LigandPNGBDBM1181(N-(3-{cyclopropyl[6-(1,3-dicyclopropylpropan-2-yl)...)
Affinity DataKi:  23nM ΔG°:  -10.3kcal/molepH: 5.0 T: 2°C. Assay description: HIV-1 protease was purified and refolded from E. coli inclusion bodies. The substrate used spans the p17-p24 processing site (R-V-S-Q-N-Y-P-I-V-Q-N-K...
In DepthDetails ArticlePubMed