BDBM118107 US8653091, 2
SMILES CC(Nc1ncnc2CCN(Cc12)c1ccc(C)cn1)c1cccc(F)c1
InChI Key InChIKey=GJAUWURFLVNMPO-UHFFFAOYSA-N
Data  1 IC50
  Tab Delimited (TSV)   2D SDfile   Computed 3D by Vconf -m prep SDfile
Find this compound or compounds like it in BindingDB:
Activity Spreadsheet -- Enzyme Inhibition Constant Data from BindingDB
Found 1 hit for monomerid = 118107
TargetP2X purinoceptor 3(Homo sapiens (Human))
Evotec
US Patent
LigandPNGBDBM118107(US8653091, 2)
Affinity DataIC50:  56nM. Assay description: The purinergic receptors P2X2 and P2X3 are expressed in a variety of tissues including various sensory and sympathetic ganglia, such as the dorsal ro...
In DepthDetails US Patent