BDBM118139 US8653091, 34
SMILES C[C@@H](Nc1ncnc2CCN(Cc12)c1ccc(C)cn1)c1ccc(C)cc1
InChI Key InChIKey=JSQPMXXGCBUZST-QGZVFWFLSA-N
Data  1 IC50
  Tab Delimited (TSV)   2D SDfile   Computed 3D by Vconf -m prep SDfile
Find this compound or compounds like it in BindingDB:
Activity Spreadsheet -- Enzyme Inhibition Constant Data from BindingDB
Found 1 hit for monomerid = 118139
TargetP2X purinoceptor 3(Homo sapiens (Human))
Evotec
US Patent
LigandPNGBDBM118139(US8653091, 34)
Affinity DataIC50:  47nM. Assay description: The purinergic receptors P2X2 and P2X3 are expressed in a variety of tissues including various sensory and sympathetic ganglia, such as the dorsal ro...
In DepthDetails US Patent