BDBM1183 4-cyano-N-(3-{cyclopropyl[6-(1,3-dicyclopropylpropan-2-yl)-4-hydroxy-2-oxo-2H-pyran-3-yl]methyl}phenyl)benzene-1-sulfonamide::N-[3-[Cyclopropyl[6-[2-cyclopropyl-1-(cyclopropyl-methyl)ethyl]-4-hydroxy-2-oxo-2H-pyran-3-yl]methyl]phenyl]-4-cyanobenzenesulfonamide::Sulfonamide-Containing 4-Hydroxy-2-pyrone deriv. XXIII
SMILES Oc1cc(oc(=O)c1C(C1CC1)c1cccc(NS(=O)(=O)c2ccc(cc2)C#N)c1)C(CC1CC1)CC1CC1
InChI Key InChIKey=GDZNOQJDTRZGEW-UHFFFAOYSA-N
Data  1 KI
  Tab Delimited (TSV)   2D SDfile   Computed 3D by Vconf -m prep SDfile
Find this compound or compounds like it in BindingDB:
Activity Spreadsheet -- Enzyme Inhibition Constant Data from BindingDB
Found 1 hit for monomerid = 1183
TargetDimer of Gag-Pol polyprotein [489-587](Human immunodeficiency virus type 1)
Upjohn
LigandPNGBDBM1183(4-cyano-N-(3-{cyclopropyl[6-(1,3-dicyclopropylprop...)
Affinity DataKi:  5.40nM ΔG°:  -11.2kcal/molepH: 5.0 T: 2°C. Assay description: HIV-1 protease was purified and refolded from E. coli inclusion bodies. The substrate used spans the p17-p24 processing site (R-V-S-Q-N-Y-P-I-V-Q-N-K...
In DepthDetails ArticlePubMed