BDBM11883 1-Cyclopropyl-N-hydroxy-4-{[4-(phenylthio)phenyl]-sulfonyl}piperidine-4-carboxamide Hydrochloride::1-cyclopropyl-N-hydroxy-4-{[4-(phenylsulfanyl)benzene]sulfonyl}piperidine-4-carboxamide hydrochloride::alpha-sulfone 35d
SMILES ONC(=O)C1(CCN(CC1)C1CC1)S(=O)(=O)c1ccc(Sc2ccccc2)cc1
InChI Key InChIKey=YDYDCNNQCGFQDL-UHFFFAOYSA-N
Data  6 KI
  Tab Delimited (TSV)   2D SDfile   Computed 3D by Vconf -m prep SDfile
Find this compound or compounds like it in BindingDB:
Activity Spreadsheet -- Enzyme Inhibition Constant Data from BindingDB
Found 6 hits for monomerid = 11883
Target72 kDa type IV collagenase(Homo sapiens (Human))
Pfizer
LigandPNGBDBM11883(1-Cyclopropyl-N-hydroxy-4-{[4-(phenylthio)phenyl]-...)
Affinity DataKi:  0.100nM. Assay description: Inhibitors were assayed against purified hMMP-1, hMMP-2, hMMP-3, hMMP-8, hMMP-9, and hMMP-13 using an enzyme assay based on cleavage of the quenched ...
In DepthDetails ArticlePubMed
TargetCollagenase 3(Homo sapiens (Human))
Pfizer
LigandPNGBDBM11883(1-Cyclopropyl-N-hydroxy-4-{[4-(phenylthio)phenyl]-...)
Affinity DataKi:  0.200nM. Assay description: Inhibitors were assayed against purified hMMP-1, hMMP-2, hMMP-3, hMMP-8, hMMP-9, and hMMP-13 using an enzyme assay based on cleavage of the quenched ...
In DepthDetails ArticlePubMed
TargetMatrix metalloproteinase-9(Homo sapiens (Human))
Pfizer
LigandPNGBDBM11883(1-Cyclopropyl-N-hydroxy-4-{[4-(phenylthio)phenyl]-...)
Affinity DataKi:  2.5nM. Assay description: Inhibitors were assayed against purified hMMP-1, hMMP-2, hMMP-3, hMMP-8, hMMP-9, and hMMP-13 using an enzyme assay based on cleavage of the quenched ...
In DepthDetails ArticlePubMed
TargetNeutrophil collagenase(Homo sapiens (Human))
Pfizer
LigandPNGBDBM11883(1-Cyclopropyl-N-hydroxy-4-{[4-(phenylthio)phenyl]-...)
Affinity DataKi:  3.5nM. Assay description: Inhibitors were assayed against purified hMMP-1, hMMP-2, hMMP-3, hMMP-8, hMMP-9, and hMMP-13 using an enzyme assay based on cleavage of the quenched ...
In DepthDetails ArticlePubMed
TargetStromelysin-1(Homo sapiens (Human))
Pfizer
LigandPNGBDBM11883(1-Cyclopropyl-N-hydroxy-4-{[4-(phenylthio)phenyl]-...)
Affinity DataKi:  23.5nM. Assay description: Inhibitors were assayed against purified hMMP-1, hMMP-2, hMMP-3, hMMP-8, hMMP-9, and hMMP-13 using an enzyme assay based on cleavage of the quenched ...
In DepthDetails ArticlePubMed
TargetInterstitial collagenase(Homo sapiens (Human))
Pfizer
LigandPNGBDBM11883(1-Cyclopropyl-N-hydroxy-4-{[4-(phenylthio)phenyl]-...)
Affinity DataKi: >1.00E+4nM. Assay description: Inhibitors were assayed against purified hMMP-1, hMMP-2, hMMP-3, hMMP-8, hMMP-9, and hMMP-13 using an enzyme assay based on cleavage of the quenched ...
In DepthDetails ArticlePubMed