BDBM119060 US8674100, 141
SMILES CC(C)(CN1C[C@H](O)[C@H](O)C1)c1ccc(NC(=O)c2ncc([nH]2)C#N)c(c1)C1=CCC(C)(C)CC1
InChI Key InChIKey=GAFYDZYQJNRLRB-ZRZAMGCNSA-N
Data  1 IC50
  Tab Delimited (TSV)   2D SDfile   Computed 3D by Vconf -m prep SDfile
Find this compound or compounds like it in BindingDB:
Activity Spreadsheet -- Enzyme Inhibition Constant Data from BindingDB
Found 1 hit for monomerid = 119060
TargetMacrophage colony-stimulating factor 1 receptor(Mus musculus (Mouse))
Janssen Pharmaceutica
US Patent
LigandPNGBDBM119060(US8674100, 141)
Affinity DataIC50:  18nMpH: 7.5Assay Description:A fluorescence polarization competition immunoassay was used to measure compound inhibition of CSF-1R phosphorylation of tyrosine on a synthetic CSF-...
In DepthDetails US Patent