BDBM119067 RWJ-3981 (compound 2)
SMILES Clc1ssc(=O)c1-c1ccccc1
InChI Key InChIKey=BWTGFYQZOUAOQW-UHFFFAOYSA-N
Data  1 IC50
  Tab Delimited (TSV)   2D SDfile   Computed 3D by Vconf -m prep SDfile
Find this compound or compounds like it in BindingDB:
Activity Spreadsheet -- Enzyme Inhibition Constant Data from BindingDB
Found 1 hit for monomerid = 119067
TargetUDP-N-acetylglucosamine 1-carboxyvinyltransferase(Escherichia coli K-12 (Enterobacteria))
University Of Ljubljana
LigandPNGBDBM119067(RWJ-3981 (compound 2))
Affinity DataIC50:  200nM
Ligand InfoPC cidPC sid
In DepthDetails ArticlePubMed