BDBM119242 US8673906, 3.02
SMILES CC(N(C)c1ccc(F)cc1)c1cc(cc2c1oc(cc2=O)N1CCOCC1)C(=O)N(C)CCN(C)C
InChI Key InChIKey=AWZVLYNJFARKIK-UHFFFAOYSA-N
Data  1 IC50
  Tab Delimited (TSV)   2D SDfile   Computed 3D by Vconf -m prep SDfile
Find this compound or compounds like it in BindingDB:
Activity Spreadsheet -- Enzyme Inhibition Constant Data from BindingDB
Found 1 hit for monomerid = 119242
LigandPNGBDBM119242(US8673906, 3.02)
Affinity DataIC50:  11nM. Assay description: The inhibition of PI3Kβ, PI3Kα, PI3Kγ and PI3Kδ was evaluated in a Kinase Glo based enzyme activity assay using human recombinant...
In DepthDetails US Patent