BDBM119270 US8673906, 3.3::US9718800, 3.30
SMILES COc1cc(F)cc(NC(C)c2cc(cc3c2oc(cc3=O)N2CCOCC2)C(=O)N(C)C)c1
InChI Key InChIKey=PKOQQRKDYMICGM-UHFFFAOYSA-N
Data  7 IC50
  Tab Delimited (TSV)   2D SDfile   Computed 3D by Vconf -m prep SDfile
Find this compound or compounds like it in BindingDB:
Activity Spreadsheet -- Enzyme Inhibition Constant Data from BindingDB
Found 7 hits for monomerid = 119270
LigandPNGBDBM119270(US8673906, 3.3 | US9718800, 3.30)
Affinity DataIC50:  4nM. Assay description: The inhibition of PI3Kβ, PI3Kα, PI3Kγ and PI3Kδ was evaluated in a Kinase Glo based enzyme activity assay using human recombinant...
In DepthDetails US Patent
LigandPNGBDBM119270(US8673906, 3.3 | US9718800, 3.30)
Affinity DataIC50:  1.60E+3nM. Assay description: Inhibition of human recombinant PI3Kgamma using PIP2 by Kinase-Glo Plus assay
In DepthDetails ArticlePubMed
LigandPNGBDBM119270(US8673906, 3.3 | US9718800, 3.30)
Affinity DataIC50:  61nM. Assay description: Inhibition of human recombinant PI3Kdelta using PIP2 by Kinase-Glo Plus assay
In DepthDetails ArticlePubMed
LigandPNGBDBM119270(US8673906, 3.3 | US9718800, 3.30)
Affinity DataIC50:  4nMT: 2°C. Assay description: Compounds in 100% DMSO were added to assay plates by acoustic dispensing. PI3Kβ was added in a Tris buffer (50 mM Tris pH7.4, 0.05% CHAPS, 2.1 m...
In DepthDetails US Patent
LigandPNGBDBM119270(US8673906, 3.3 | US9718800, 3.30)
Affinity DataIC50:  10nM. Assay description: Inhibition of human recombinant PI3Kbeta using PIP2 by Kinase-Glo Plus assay
In DepthDetails ArticlePubMed
LigandPNGBDBM119270(US8673906, 3.3 | US9718800, 3.30)
Affinity DataIC50:  160nM. Assay description: Inhibition of human recombinant PI3Kalpha using PIP2 by Kinase-Glo Plus assay
In DepthDetails ArticlePubMed
LigandPNGBDBM119270(US8673906, 3.3 | US9718800, 3.30)
Affinity DataIC50:  15nM. Assay description: Inhibition of PI3Kbeta in PTEN-null human MDA-MB-468 cells assessed as inhibition of Akt phosphorylation after 2 hrs
In DepthDetails ArticlePubMed