BDBM119322 US8673906, 9.01::US9718800, 9.01
SMILES CC(Nc1cc(F)cc(F)c1)c1cc(cc2c1oc(cc2=O)N1CCO[C@H](C)C1)C(=O)N(C)C
InChI Key InChIKey=LXCSAPOGAXFOIJ-GICMACPYSA-N
Data  2 IC50
  Tab Delimited (TSV)   2D SDfile   Computed 3D by Vconf -m prep SDfile
Find this compound or compounds like it in BindingDB:
Activity Spreadsheet -- Enzyme Inhibition Constant Data from BindingDB
Found 2 hits for monomerid = 119322
LigandPNGBDBM119322(US8673906, 9.01 | US9718800, 9.01)
Affinity DataIC50:  4nMT: 2°C. Assay description: Compounds in 100% DMSO were added to assay plates by acoustic dispensing. PI3Kβ was added in a Tris buffer (50 mM Tris pH7.4, 0.05% CHAPS, 2.1 m...
In DepthDetails US Patent
LigandPNGBDBM119322(US8673906, 9.01 | US9718800, 9.01)
Affinity DataIC50:  4nM. Assay description: The inhibition of PI3Kβ, PI3Kα, PI3Kγ and PI3Kδ was evaluated in a Kinase Glo based enzyme activity assay using human recombinant...
In DepthDetails US Patent